Reaction Details
TargetSubstance-P receptor
LigandBDBM50364194
Substrate/Competitorn/a
Meas. Tech.ChEMBL_804013 (CHEMBL1954993)
IC50 0.073±n/a nM
Citation Shirai, JSugiyama, HMorimoto, SMaezaki, HYamamoto, YOkanishi, SKamo, IMatsumoto, SIshigami, KInatomi, NImanishi, AKawamoto, MTarui, NHashimoto, TIkeura, Y Novel 3-phenylpiperidine-4-carboxamides as highly potent and orally long-acting neurokinin-1 receptor antagonists with reduced CYP3A induction. Bioorg Med Chem20:962-77 (2012) 
 
Substance-P receptor
Name:Substance-P receptor
Type:G Protein-Coupled Receptor (GPCR)
Mol. Mass.:46254.43
Organism:Homo sapiens (Human)
Description:P25103
Residue:407
BDBM50364194
NameBDBM50364194
Synonyms:CHEMBL1951634
TypeSmall organic molecule
Emp. Form.C25H26F7N3O3
Mol. Mass.549.4811
SMILESCONC(=O)N1CC[C@@H]([C@H](C1)c1ccc(F)cc1C)C(=O)N(C)Cc1cc(cc(c1)C(F)(F)F)C(F)(F)F