Reaction Details
TargetcAMP and cAMP-inhibited cGMP 3',5'-cyclic phosphodiesterase 10A
LigandBDBM50365499
Substrate/Competitorn/a
Meas. Tech.ChEMBL_807649 (CHEMBL1960211)
IC50 608±n/a nM
Citation Bauer, UGiordanetto, FBauer, MO'Mahony, GJohansson, KEKnecht, WHartleib-Geschwindner, JCarlsson, ETEnroth, C Discovery of 4-hydroxy-1,6-naphthyridine-3-carbonitrile derivatives as novel PDE10A inhibitors. Bioorg Med Chem Lett22:1944-8 (2012) 
 
cAMP and cAMP-inhibited cGMP 3',5'-cyclic phosphodiesterase 10A
Name:cAMP and cAMP-inhibited cGMP 3',5'-cyclic phosphodiesterase 10A
Type:Protein
Mol. Mass.:88412.52
Organism:Homo sapiens (Human)
Description:Q9Y233
Residue:1055
BDBM50365499
NameBDBM50365499
Synonyms:CHEMBL1957461
TypeSmall organic molecule
Emp. Form.C19H13N5O
Mol. Mass.327.3394
SMILESCn1cc(cn1)-c1ccc(cc1)-c1nc2ccncc2c(O)c1C#N