Reaction Details
TargetGag-Pol polyprotein [489-587]
LigandBDBM50281642
Substrate/Competitorn/a
Meas. Tech.ChEBML_157566
Ki 8±n/a nM
Citation Sawyer, TFisher, JHester, JSmith, CTomasselli, ATarpley, WBurton, PHui, JMcQuade, TConradi, RBradford, VLiu, LKinner, JTustin, JAlexander, DHarrison, AEmmert, DStaples, DMaggiora, LZhang, YPoorman, RDunna, BRao, CScarborough, PLowther, WCraik, CDeCamp, DMoon, JHowe, WHeinrikson, R Peptidomimetic inhibitors of human immunodeficiency virus protease (HIV-PR): Design, enzyme binding and selectivity, antiviral efficacy, and cell permeability properties Bioorg Med Chem Lett3:819-824 (1993)    Article
 
Gag-Pol polyprotein [489-587]
Name:Gag-Pol polyprotein [489-587]
Type:Enzyme Subunit
Mol. Mass.:10781.16
Organism:Human immunodeficiency virus type 1
Description:P04585[489-587]
Residue:99
BDBM50281642
NameBDBM50281642
Synonyms:((1S,2S,4S)-1-Cyclohexylmethyl-2-hydroxy-5-methyl-4-{(S)-2-methyl-1-[(pyridin-2-ylmethyl)-carbamoyl]-butylcarbamoyl}-hexyl)-carbamic acid tert-butyl ester | CHEMBL166175
TypeSmall organic molecule
Emp. Form.C32H54N4O5
Mol. Mass.574.795
SMILESCCC(C)[C@H](NC(=O)[C@@H](C[C@H](O)[C@H](CC1CCCCC1)NC(=O)OC(C)(C)C)C(C)C)C(=O)NCc1ccccn1