Reaction Details
TargetGag-Pol polyprotein [489-587]
LigandBDBM50281649
Substrate/Competitorn/a
Meas. Tech.ChEBML_157566
Ki>1000±n/a nM
Citation Sawyer, TFisher, JHester, JSmith, CTomasselli, ATarpley, WBurton, PHui, JMcQuade, TConradi, RBradford, VLiu, LKinner, JTustin, JAlexander, DHarrison, AEmmert, DStaples, DMaggiora, LZhang, YPoorman, RDunna, BRao, CScarborough, PLowther, WCraik, CDeCamp, DMoon, JHowe, WHeinrikson, R Peptidomimetic inhibitors of human immunodeficiency virus protease (HIV-PR): Design, enzyme binding and selectivity, antiviral efficacy, and cell permeability properties Bioorg Med Chem Lett3:819-824 (1993)    Article
 
Gag-Pol polyprotein [489-587]
Name:Gag-Pol polyprotein [489-587]
Type:Enzyme Subunit
Mol. Mass.:10781.16
Organism:Human immunodeficiency virus type 1
Description:P04585[489-587]
Residue:99
BDBM50281649
NameBDBM50281649
Synonyms:(S)-2-((2S,4S,5S)-5-{(S)-3-Carbamoyl-2-[(quinoline-2-carbonyl)-amino]-propionylamino}-6-cyclohexyl-4-hydroxy-2-isopropyl-hexanoylamino)-3-methyl-pentanoic acid | CHEMBL353108
TypeSmall organic molecule
Emp. Form.C35H51N5O7
Mol. Mass.653.8087
SMILESCCC(C)[C@H](NC(=O)[C@@H](C[C@H](O)[C@H](CC1CCCCC1)NC(=O)[C@H](CC(N)=O)NC(=O)c1ccc2ccccc2n1)C(C)C)C(O)=O