Reaction Details
TargetEndothelin-1 receptor
LigandBDBM50071433
Substrate/Competitorn/a
Meas. Tech.ChEBML_65818
Ki 440±n/a nM
Citation Fruh, TSaika, HSvensson, LPitterna, TSakaki, JOkada, TUrade, YOda, KFujitani, YTakimoto, MYamamura, TInui, TMakatani, MUmemura, ITeno, NToh, HHayakawa, KMurata, T IRL 2500: A potent ETB selective endothelin antagonist Bioorg Med Chem Lett6:2323-2328 (1996)    Article
 
Endothelin-1 receptor
Name:Endothelin-1 receptor
Type:PROTEIN
Mol. Mass.:48707.29
Organism:Sus scrofa
Description:ChEMBL_65803
Residue:427
BDBM50071433
NameBDBM50071433
Synonyms:(S)-2-{(R)-3-Biphenyl-4-yl-2-[(3,5-dimethyl-benzoyl)-methyl-amino]-propionylamino}-3-(1H-indol-3-yl)-propionic acid | CHEMBL72410
TypeSmall organic molecule
Emp. Form.C36H35N3O4
Mol. Mass.573.6808
SMILESCN([C@H](Cc1ccc(cc1)-c1ccccc1)C(=O)N[C@@H](Cc1c[nH]c2ccccc12)C(O)=O)C(=O)c1cc(C)cc(C)c1