Reaction Details
TargetGastrin-releasing peptide receptor
LigandBDBM50288238
Substrate/Competitorn/a
Meas. Tech.ChEBML_71531
Ki>10000±n/a nM
Citation Eden, JHall, MHigginbottom, MHorwell, DHowson, WHughes, JJordan, RLewthwaite, RMartin, KMcKnight, APinnock, RPritchard, MSuman-Chauhan, NWilliams, S PD 165929 the first high affinity non-peptide neuromedin-B (NMB) receptor selective antagonist Bioorg Med Chem Lett6:2617-2622 (1996)    Article
 
Gastrin-releasing peptide receptor
Name:Gastrin-releasing peptide receptor
Type:Enzyme Catalytic Domain
Mol. Mass.:43214.53
Organism:Homo sapiens (Human)
Description:Bombesin 2 GRPR 0::P30550
Residue:384
BDBM50288238
NameBDBM50288238
Synonyms:2-[3-(2,6-Diisopropyl-phenyl)-ureido]-N-((S)-2,2-dimethyl-4-phenyl-[1,3]dioxan-5-yl)-3-(1H-indol-3-yl)-2-methyl-propionamide | CHEMBL89075
TypeSmall organic molecule
Emp. Form.C37H46N4O4
Mol. Mass.610.7855
SMILESCC(C)c1cccc(C(C)C)c1NC(=O)NC(C)(Cc1c[nH]c2ccccc12)C(=O)N[C@H]1COC(C)(C)OC1c1ccccc1