Reaction Details
TargetNeuromedin-B receptor
LigandBDBM50288241
Substrate/Competitorn/a
Meas. Tech.ChEBML_143206
Ki 490±n/a nM
Citation Eden, JHall, MHigginbottom, MHorwell, DHowson, WHughes, JJordan, RLewthwaite, RMartin, KMcKnight, APinnock, RPritchard, MSuman-Chauhan, NWilliams, S PD 165929 the first high affinity non-peptide neuromedin-B (NMB) receptor selective antagonist Bioorg Med Chem Lett6:2617-2622 (1996)    Article
 
Neuromedin-B receptor
Name:Neuromedin-B receptor
Type:Enzyme Catalytic Domain
Mol. Mass.:43447.11
Organism:Homo sapiens (Human)
Description:Bombesin 1 NMBR 0::P28336
Residue:390
BDBM50288241
NameBDBM50288241
Synonyms:CHEMBL328230 | N-Cyclohexylmethyl-2-[3-(2,6-diisopropyl-phenyl)-ureido]-3-(1H-indol-3-yl)-N-methyl-propionamide
TypeSmall organic molecule
Emp. Form.C32H44N4O2
Mol. Mass.516.7174
SMILESCC(C)c1cccc(C(C)C)c1NC(=O)NC(Cc1c[nH]c2ccccc12)C(=O)N(C)CC1CCCCC1