Reaction Details
TargetNeuromedin-B receptor
LigandBDBM50288251
Substrate/Competitorn/a
Meas. Tech.ChEBML_143206
Ki 310±n/a nM
Citation Eden, JHall, MHigginbottom, MHorwell, DHowson, WHughes, JJordan, RLewthwaite, RMartin, KMcKnight, APinnock, RPritchard, MSuman-Chauhan, NWilliams, S PD 165929 the first high affinity non-peptide neuromedin-B (NMB) receptor selective antagonist Bioorg Med Chem Lett6:2617-2622 (1996)    Article
 
Neuromedin-B receptor
Name:Neuromedin-B receptor
Type:Enzyme Catalytic Domain
Mol. Mass.:43447.11
Organism:Homo sapiens (Human)
Description:Bombesin 1 NMBR 0::P28336
Residue:390
BDBM50288251
NameBDBM50288251
Synonyms:CHEMBL87090 | N-Cyclohexyl-2-[3-(2,6-diisopropyl-phenyl)-ureido]-3-(1H-indol-3-yl)-2-methyl-propionamide
TypeSmall organic molecule
Emp. Form.C31H42N4O2
Mol. Mass.502.6908
SMILESCC(C)c1cccc(C(C)C)c1NC(=O)NC(C)(Cc1c[nH]c2ccccc12)C(=O)NC1CCCCC1