Reaction Details
TargetGenome polyprotein/Non-structural protein 4A
LigandBDBM50070797
Substrate/Competitorn/a
Meas. Tech.ChEBML_143633
Ki 600±n/a nM
Citation Llinàs-Brunet, MBailey, MFazal, GGoulet, SHalmos, TLaplante, SMaurice, RPoirier, MPoupart, MAThibeault, DWernic, DLamarre, D Peptide-based inhibitors of the hepatitis C virus serine protease. Bioorg Med Chem Lett8:1713-8 (1999) Genome polyprotein/Non-structural protein 4A
Name:Genome polyprotein/Non-structural protein 4A
Synonyms:Hepatitis C virus serine protease, NS3/NS4A
Type:n/a
Mol. Mass.:n/a
Description:ASSAY_ID of ChEMBL is 1969955
Components:This complex has 2 components.
Component 1
Name:Non-structural protein 4A
Type:PROTEIN
Mol. Mass.:5762.65
Organism:Hepatitis C virus
Description:ChEMBL_305334
Residue:54
Component 2
Name:Genome polyprotein
Synonyms:Hepatitis C virus NS3 protease/helicase | Hepatitis C virus serine protease, NS3/NS4A
Type:Protein
Mol. Mass.:67067.41
Organism:Hepatitis C virus
Description:A3EZI9
Residue:631
BDBM50070797
NameBDBM50070797
Synonyms:CHEMBL2370476 | Hexapeptide analogue
TypeSmall organic molecule
Emp. Form.C29H46N6O12S
Mol. Mass.702.774
SMILESCC[C@H](C)[C@H](NC(=O)[C@@H](CC(O)=O)NC(=O)[C@H](CC(O)=O)NC(C)=O)C(=O)N[C@@H](C(C)C)C(=O)N1CCC[C@H]1C(=O)N[C@@H](CS)C(O)=O