Reaction Details
TargetPlasmepsin II
LigandBDBM50071552
Substrate/Competitorn/a
Meas. Tech.ChEBML_154921
Ki 410±n/a nM
Citation Carroll, CDPatel, HJohnson, TOGuo, TOrlowski, MHe, ZMCavallaro, CLGuo, JOksman, AGluzman, IYConnelly, JChelsky, DGoldberg, DEDolle, RE Identification of potent inhibitors of Plasmodium falciparum plasmepsin II from an encoded statine combinatorial library. Bioorg Med Chem Lett8:2315-20 (1999) Plasmepsin II
Name:Plasmepsin II
Type:Enzyme
Mol. Mass.:51482.09
Organism:Plasmodium falciparum
Description:P46925
Residue:453
BDBM50071552
NameBDBM50071552
Synonyms:1-{[(1S,2S)-1-(1-Benzyl-3-butylcarbamoyl-2-hydroxy-propylcarbamoyl)-2-methyl-butylcarbamoyl]-methyl}-4-phenyl-piperidine-4-carboxylic acid amide | CHEMBL305635
TypeSmall organic molecule
Emp. Form.C35H51N5O5
Mol. Mass.621.8099
SMILESCCCCNC(=O)CC(O)C(Cc1ccccc1)NC(=O)[C@@H](NC(=O)CN1CCC(CC1)(C(N)=O)c1ccccc1)[C@@H](C)CC