Reaction Details
TargetCathepsin D
LigandBDBM50071555
Substrate/Competitorn/a
Meas. Tech.ChEMBL_45324 (CHEMBL661012)
Ki 560±n/a nM
Citation Carroll, CDPatel, HJohnson, TOGuo, TOrlowski, MHe, ZMCavallaro, CLGuo, JOksman, AGluzman, IYConnelly, JChelsky, DGoldberg, DEDolle, RE Identification of potent inhibitors of Plasmodium falciparum plasmepsin II from an encoded statine combinatorial library. Bioorg Med Chem Lett8:2315-20 (1999) Cathepsin D
Name:Cathepsin D
Type:Enzyme
Mol. Mass.:44551.72
Organism:Homo sapiens (Human)
Description:Human proCathepsin D (SwissProt accession number P07339) was expressed in Sf9 cells, purified, and autoactivated.
Residue:412
BDBM50071555
NameBDBM50071555
Synonyms:3-Hydroxy-4-{(2S,3S)-1-hydroxy-3-methyl-2-[2-(naphthalen-2-yloxy)-acetylamino]-pentylamino}-6-methyl-heptanoic acid butylamide | CHEMBL307156
TypeSmall organic molecule
Emp. Form.C30H47N3O5
Mol. Mass.529.7113
SMILESCCCCNC(=O)CC(O)C(CC(C)C)NC(O)[C@@H](NC(=O)COc1ccc2ccccc2c1)[C@@H](C)CC