Reaction Details
TargetCathepsin D
LigandBDBM50071558
Substrate/Competitorn/a
Meas. Tech.ChEMBL_45324 (CHEMBL661012)
Ki 320±n/a nM
Citation Carroll, CDPatel, HJohnson, TOGuo, TOrlowski, MHe, ZMCavallaro, CLGuo, JOksman, AGluzman, IYConnelly, JChelsky, DGoldberg, DEDolle, RE Identification of potent inhibitors of Plasmodium falciparum plasmepsin II from an encoded statine combinatorial library. Bioorg Med Chem Lett8:2315-20 (1999) Cathepsin D
Name:Cathepsin D
Type:Enzyme
Mol. Mass.:44551.72
Organism:Homo sapiens (Human)
Description:Human proCathepsin D (SwissProt accession number P07339) was expressed in Sf9 cells, purified, and autoactivated.
Residue:412
BDBM50071558
NameBDBM50071558
Synonyms:3-Hydroxy-6-methyl-4-[(2S,3S)-3-methyl-2-(2-naphthalen-2-yl-acetylamino)-pentanoylamino]-heptanoic acid butylamide | CHEMBL306829
TypeSmall organic molecule
Emp. Form.C30H45N3O4
Mol. Mass.511.696
SMILESCCCCNC(=O)CC(O)C(CC(C)C)NC(=O)[C@@H](NC(=O)Cc1ccc2ccccc2c1)[C@@H](C)CC