Reaction Details
TargetPlasmepsin II
LigandBDBM50071558
Substrate/Competitorn/a
Meas. Tech.ChEMBL_154920 (CHEMBL764694)
Ki 50±n/a nM
Citation Carroll, CDPatel, HJohnson, TOGuo, TOrlowski, MHe, ZMCavallaro, CLGuo, JOksman, AGluzman, IYConnelly, JChelsky, DGoldberg, DEDolle, RE Identification of potent inhibitors of Plasmodium falciparum plasmepsin II from an encoded statine combinatorial library. Bioorg Med Chem Lett8:2315-20 (1999) Plasmepsin II
Name:Plasmepsin II
Type:Enzyme
Mol. Mass.:51482.09
Organism:Plasmodium falciparum
Description:P46925
Residue:453
BDBM50071558
NameBDBM50071558
Synonyms:3-Hydroxy-6-methyl-4-[(2S,3S)-3-methyl-2-(2-naphthalen-2-yl-acetylamino)-pentanoylamino]-heptanoic acid butylamide | CHEMBL306829
TypeSmall organic molecule
Emp. Form.C30H45N3O4
Mol. Mass.511.696
SMILESCCCCNC(=O)CC(O)C(CC(C)C)NC(=O)[C@@H](NC(=O)Cc1ccc2ccccc2c1)[C@@H](C)CC