Reaction Details
Target3-oxo-5-alpha-steroid 4-dehydrogenase 2
LigandBDBM50101145
Substrate/Competitorn/a
Meas. Tech.ChEMBL_749 (CHEMBL884527)
IC50 41±n/a nM
Citation Lesuisse, DGourvest, JFAlbert, EDoucet, BHartmann, CLefrançois, JMTessier, STric, BTeutsch, G Biphenyls as surrogates of the steroidal backbone. Part 2: discovery of a novel family of non-steroidal 5-alpha-reductase inhibitors. Bioorg Med Chem Lett11:1713-6 (2001) 3-oxo-5-alpha-steroid 4-dehydrogenase 2
Name:3-oxo-5-alpha-steroid 4-dehydrogenase 2
Type:Enzyme
Mol. Mass.:28406.59
Organism:Homo sapiens (Human)
Description:P31213
Residue:254
BDBM50101145
NameBDBM50101145
Synonyms:(4aR,6aS,7S,11aR)-4a,6a-Dimethyl-2-oxo-hexadecahydro-indeno[5,4-f]quinoline-7-carboxylic acid diisopropylamide | CHEMBL297697
TypeSmall organic molecule
Emp. Form.C25H42N2O2
Mol. Mass.402.6132
SMILESCC(C)N(C(C)C)C(=O)[C@H]1CCC2C3CC[C@H]4NC(=O)CC[C@]4(C)C3CC[C@]12C