Reaction Details
TargetNeutrophil elastase
LigandBDBM50096484
Substrate/Competitorn/a
Meas. Tech.ChEBML_63638
IC50 0.036000±n/a nM
Citation Macdonald, SJDowle, MDHarrison, LASpooner, JEShah, PJohnson, MRInglis, GGClarke, GDBelton, DJSmith, RAMolloy, CRDixon, MMurkitt, GGodward, RESkarzynski, TSingh, OMKumar, KAHodgson, STMcDonald, EHardy, GWFinch, HHumphreys, DCFleetwood, G Intracellular inhibition of human neutrophil elastase by orally active pyrrolidine-trans-lactams. Bioorg Med Chem Lett11:243-6 (2001) Neutrophil elastase
Name:Neutrophil elastase
Type:Enzyme
Mol. Mass.:28532.38
Organism:Homo sapiens (Human)
Description:P08246
Residue:267
BDBM50096484
NameBDBM50096484
Synonyms:(4S,6R)-6-Allyl-4-(naphthalene-2-sulfonyl)-5-oxo-hexahydro-pyrrolo[3,2-b]pyrrole-1-carboxylic acid benzyl ester | CHEMBL2367667
TypeSmall organic molecule
Emp. Form.C27H26N2O5S
Mol. Mass.490.571
SMILES[H][C@]12CCN(C(=O)OCc3ccccc3)[C@]1([H])[C@@H](CC=C)C(=O)N2S(=O)(=O)c1ccc2ccccc2c1