Reaction Details
TargetNeutrophil elastase
LigandBDBM50096486
Substrate/Competitorn/a
Meas. Tech.ChEBML_63638
IC50 0.690000±n/a nM
Citation Macdonald, SJDowle, MDHarrison, LASpooner, JEShah, PJohnson, MRInglis, GGClarke, GDBelton, DJSmith, RAMolloy, CRDixon, MMurkitt, GGodward, RESkarzynski, TSingh, OMKumar, KAHodgson, STMcDonald, EHardy, GWFinch, HHumphreys, DCFleetwood, G Intracellular inhibition of human neutrophil elastase by orally active pyrrolidine-trans-lactams. Bioorg Med Chem Lett11:243-6 (2001) Neutrophil elastase
Name:Neutrophil elastase
Type:Enzyme
Mol. Mass.:28532.38
Organism:Homo sapiens (Human)
Description:P08246
Residue:267
BDBM50096486
NameBDBM50096486
Synonyms:CHEMBL2367646 | benzyl (3aS,6aR)-4-acetyl-6-allyl-5-oxohexahydropyrrolo[3,2-b]pyrrole-1(2H)-carboxylate
TypeSmall organic molecule
Emp. Form.C19H22N2O4
Mol. Mass.342.389
SMILES[H][C@]12CCN(C(=O)OCc3ccccc3)[C@]1([H])[C@@H](CC=C)C(=O)N2C(C)=O