Reaction Details
TargetNeutrophil elastase
LigandBDBM50096487
Substrate/Competitorn/a
Meas. Tech.ChEBML_63638
IC50 2±n/a nM
Citation Macdonald, SJDowle, MDHarrison, LASpooner, JEShah, PJohnson, MRInglis, GGClarke, GDBelton, DJSmith, RAMolloy, CRDixon, MMurkitt, GGodward, RESkarzynski, TSingh, OMKumar, KAHodgson, STMcDonald, EHardy, GWFinch, HHumphreys, DCFleetwood, G Intracellular inhibition of human neutrophil elastase by orally active pyrrolidine-trans-lactams. Bioorg Med Chem Lett11:243-6 (2001) Neutrophil elastase
Name:Neutrophil elastase
Type:Enzyme
Mol. Mass.:28532.38
Organism:Homo sapiens (Human)
Description:P08246
Residue:267
BDBM50096487
NameBDBM50096487
Synonyms:(3R,6aS)-3-Allyl-2-oxo-hexahydro-pyrrolo[3,2-b]pyrrole-1,4-dicarboxylic acid 4-benzyl ester 1-ethyl ester | CHEMBL2367636
TypeSmall organic molecule
Emp. Form.C20H24N2O5
Mol. Mass.372.415
SMILES[H][C@]12CCN(C(=O)OCc3ccccc3)[C@]1([H])[C@@H](CC=C)C(=O)N2C(=O)OCC