Reaction Details
TargetRAF proto-oncogene serine/threonine-protein kinase
LigandBDBM50105602
Substrate/Competitorn/a
Meas. Tech.ChEBML_163037
IC50 11000±n/a nM
Citation Smith, RABarbosa, JBlum, CLBobko, MACaringal, YVDally, RJohnson, JSKatz, MEKennure, NKingery-Wood, JLee, WLowinger, TBLyons, JMarsh, VRogers, DHSwartz, SWalling, TWild, H Discovery of heterocyclic ureas as a new class of raf kinase inhibitors: identification of a second generation lead by a combinatorial chemistry approach. Bioorg Med Chem Lett11:2775-8 (2001) RAF proto-oncogene serine/threonine-protein kinase
Name:RAF proto-oncogene serine/threonine-protein kinase
Type:Serine/threonine-protein kinase
Mol. Mass.:73082.52
Organism:Homo sapiens (Human)
Description:P04049
Residue:648
BDBM50105602
NameBDBM50105602
Synonyms:5-tert-Butyl-3-[3-(1-propyl-1H-pyrrol-3-yl)-ureido]-thiophene-2-carboxylic acid methyl ester | CHEMBL328572
TypeSmall organic molecule
Emp. Form.C18H25N3O3S
Mol. Mass.363.474
SMILESCCCn1ccc(NC(=O)Nc2cc(sc2C(=O)OC)C(C)(C)C)c1