Reaction Details
TargetRAF proto-oncogene serine/threonine-protein kinase
LigandBDBM50105604
Substrate/Competitorn/a
Meas. Tech.ChEBML_163037
IC50 11000±n/a nM
Citation Smith, RABarbosa, JBlum, CLBobko, MACaringal, YVDally, RJohnson, JSKatz, MEKennure, NKingery-Wood, JLee, WLowinger, TBLyons, JMarsh, VRogers, DHSwartz, SWalling, TWild, H Discovery of heterocyclic ureas as a new class of raf kinase inhibitors: identification of a second generation lead by a combinatorial chemistry approach. Bioorg Med Chem Lett11:2775-8 (2001) RAF proto-oncogene serine/threonine-protein kinase
Name:RAF proto-oncogene serine/threonine-protein kinase
Type:Serine/threonine-protein kinase
Mol. Mass.:73082.52
Organism:Homo sapiens (Human)
Description:P04049
Residue:648
BDBM50105604
NameBDBM50105604
Synonyms:5-tert-Butyl-3-[3-(5-tert-butyl-[1,3,4]thiadiazol-2-yl)-ureido]-thiophene-2-carboxylic acid methyl ester methyl 5-tert-butyl-3-(3-(5-tert-butyl-1,3,4-thiadiazol-2-yl)ureido)thiophene-2-carboxylate
TypeSmall organic molecule
Emp. Form.C17H24N4O3S2
Mol. Mass.396.527
SMILESCOC(=O)c1sc(cc1NC(=O)Nc1nnc(s1)C(C)(C)C)C(C)(C)C