Reaction Details
TargetRAF proto-oncogene serine/threonine-protein kinase
LigandBDBM50095394
Substrate/Competitorn/a
Meas. Tech.ChEBML_163037
IC50 7700±n/a nM
Citation Smith, RABarbosa, JBlum, CLBobko, MACaringal, YVDally, RJohnson, JSKatz, MEKennure, NKingery-Wood, JLee, WLowinger, TBLyons, JMarsh, VRogers, DHSwartz, SWalling, TWild, H Discovery of heterocyclic ureas as a new class of raf kinase inhibitors: identification of a second generation lead by a combinatorial chemistry approach. Bioorg Med Chem Lett11:2775-8 (2001) RAF proto-oncogene serine/threonine-protein kinase
Name:RAF proto-oncogene serine/threonine-protein kinase
Type:Serine/threonine-protein kinase
Mol. Mass.:73082.52
Organism:Homo sapiens (Human)
Description:P04049
Residue:648
BDBM50095394
NameBDBM50095394
Synonyms:5-tert-Butyl-3-[3-(3,4-dichloro-phenyl)-ureido]-furan-2-carboxylic acid methyl ester | CHEMBL278057
TypeSmall organic molecule
Emp. Form.C17H18Cl2N2O4
Mol. Mass.385.242
SMILESCOC(=O)c1oc(cc1NC(=O)Nc1ccc(Cl)c(Cl)c1)C(C)(C)C