Reaction Details
TargetRAF proto-oncogene serine/threonine-protein kinase
LigandBDBM50105614
Substrate/Competitorn/a
Meas. Tech.ChEBML_163037
IC50 8100±n/a nM
Citation Smith, RABarbosa, JBlum, CLBobko, MACaringal, YVDally, RJohnson, JSKatz, MEKennure, NKingery-Wood, JLee, WLowinger, TBLyons, JMarsh, VRogers, DHSwartz, SWalling, TWild, H Discovery of heterocyclic ureas as a new class of raf kinase inhibitors: identification of a second generation lead by a combinatorial chemistry approach. Bioorg Med Chem Lett11:2775-8 (2001) RAF proto-oncogene serine/threonine-protein kinase
Name:RAF proto-oncogene serine/threonine-protein kinase
Type:Serine/threonine-protein kinase
Mol. Mass.:73082.52
Organism:Homo sapiens (Human)
Description:P04049
Residue:648
BDBM50105614
NameBDBM50105614
Synonyms:5-tert-Butyl-3-[3-(1-isopropyl-1H-pyrrol-3-yl)-ureido]-thiophene-2-carboxylic acid methyl ester methyl 5-tert-butyl-3-(3-(1-isopropyl-1H-pyrrol-3-yl)ureido)thiophene-2-carboxylate
TypeSmall organic molecule
Emp. Form.C18H25N3O3S
Mol. Mass.363.474
SMILESCOC(=O)c1sc(cc1NC(=O)Nc1ccn(c1)C(C)C)C(C)(C)C