Reaction Details
TargetRAF proto-oncogene serine/threonine-protein kinase
LigandBDBM50095414
Substrate/Competitorn/a
Meas. Tech.ChEBML_163037
IC50 6000±n/a nM
Citation Smith, RABarbosa, JBlum, CLBobko, MACaringal, YVDally, RJohnson, JSKatz, MEKennure, NKingery-Wood, JLee, WLowinger, TBLyons, JMarsh, VRogers, DHSwartz, SWalling, TWild, H Discovery of heterocyclic ureas as a new class of raf kinase inhibitors: identification of a second generation lead by a combinatorial chemistry approach. Bioorg Med Chem Lett11:2775-8 (2001) RAF proto-oncogene serine/threonine-protein kinase
Name:RAF proto-oncogene serine/threonine-protein kinase
Type:Serine/threonine-protein kinase
Mol. Mass.:73082.52
Organism:Homo sapiens (Human)
Description:P04049
Residue:648
BDBM50095414
NameBDBM50095414
Synonyms:5-tert-Butyl-3-(3-p-tolyl-ureido)-thiophene-2-carboxylic acid ethyl ester | CHEMBL275580
TypeSmall organic molecule
Emp. Form.C19H24N2O3S
Mol. Mass.360.47
SMILESCCOC(=O)c1sc(cc1NC(=O)Nc1ccc(C)cc1)C(C)(C)C