Reaction Details
TargetBeta-3 adrenergic receptor
LigandBDBM50002134
Substrate/Competitorn/a
Meas. Tech.ChEMBL_39052 (CHEMBL652053)
Ki 20000±n/a nM
Citation Washburn, WNSher, PMPoss, KMGirotra, RNMcCann, PJGavai, AVMikkilineni, ABMathur, ACheng, PDejneka, TCSun, CQWang, TCHarper, TWRussell, ADSlusarchyk, DASkwish, SAllen, GTHillyer, DEFrohlich, BHAbboa-Offei, BECap, MWaldron, TLGeorge, RJTesfamariam, BCiosek, CPRyono, DYoung, DADickinson, KESeymour, AAArbeeny, CMGregg, RE Beta 3 agonists. Part 1: evolution from inception to BMS-194449. Bioorg Med Chem Lett11:3035-9 (2001) Beta-3 adrenergic receptor
Name:Beta-3 adrenergic receptor
Type:G Protein-Coupled Receptor (GPCR)
Mol. Mass.:43534.88
Organism:Homo sapiens (Human)
Description:n/a
Residue:408
BDBM50002134
NameBDBM50002134
Synonyms:5-((2R)-2-{[(2R)-2-(3-chlorophenyl)-2-hydroxyethyl]amino}propyl)-1,3-benzodioxole-2,2-dicarboxylate 5-{2-[2-(3-Chloro-phenyl)-2-hydroxy-ethylamino]-propyl}-benzo[1,3]dioxole-2,2-dicarboxylic acid;Disodium salt CL-316243 disodium 5-((2R)-2-{[(2R)-2-(3-chlorophenyl)-2-hydroxyethyl]amino}propyl)-1,3-benzodioxole-2,2-dicarboxylate | disodium 5-[2-[2-(3-chlorophenyl)-2-hydroxyethylamino]-(2R)-propyl]benzo[d][1,3]dioxole-2,2-dicarboxylate(CL 316,243)
TypeSmall organic molecule
Emp. Form.C20H18ClNO7
Mol. Mass.419.814
SMILESC[C@H](Cc1ccc2OC(Oc2c1)(C([O-])=O)C([O-])=O)NC[C@H](O)c1cccc(Cl)c1