Reaction Details
TargetBeta-3 adrenergic receptor
LigandBDBM50106810
Substrate/Competitorn/a
Meas. Tech.ChEBML_39052
Ki 11±n/a nM
Citation Washburn, WNSher, PMPoss, KMGirotra, RNMcCann, PJGavai, AVMikkilineni, ABMathur, ACheng, PDejneka, TCSun, CQWang, TCHarper, TWRussell, ADSlusarchyk, DASkwish, SAllen, GTHillyer, DEFrohlich, BHAbboa-Offei, BECap, MWaldron, TLGeorge, RJTesfamariam, BCiosek, CPRyono, DYoung, DADickinson, KESeymour, AAArbeeny, CMGregg, RE Beta 3 agonists. Part 1: evolution from inception to BMS-194449. Bioorg Med Chem Lett11:3035-9 (2001) Beta-3 adrenergic receptor
Name:Beta-3 adrenergic receptor
Type:G Protein-Coupled Receptor (GPCR)
Mol. Mass.:43534.88
Organism:Homo sapiens (Human)
Description:n/a
Residue:408
BDBM50106810
NameBDBM50106810
Synonyms:CHEMBL317621 N-(5-{2-[1-(3,4-Dimethoxy-phenyl)-2-phenyl-ethylamino]-1-hydroxy-ethyl}-2-hydroxy-phenyl)-methanesulfonamide
TypeSmall organic molecule
Emp. Form.C25H30N2O6S
Mol. Mass.486.581
SMILESCOc1ccc(cc1OC)[C@@H](Cc1ccccc1)NC[C@H](O)c1ccc(O)c(NS(C)(=O)=O)c1