Reaction Details
TargetBeta-3 adrenergic receptor
LigandBDBM50106817
Substrate/Competitorn/a
Meas. Tech.ChEBML_39052
Ki 300±n/a nM
Citation Washburn, WNSher, PMPoss, KMGirotra, RNMcCann, PJGavai, AVMikkilineni, ABMathur, ACheng, PDejneka, TCSun, CQWang, TCHarper, TWRussell, ADSlusarchyk, DASkwish, SAllen, GTHillyer, DEFrohlich, BHAbboa-Offei, BECap, MWaldron, TLGeorge, RJTesfamariam, BCiosek, CPRyono, DYoung, DADickinson, KESeymour, AAArbeeny, CMGregg, RE Beta 3 agonists. Part 1: evolution from inception to BMS-194449. Bioorg Med Chem Lett11:3035-9 (2001) Beta-3 adrenergic receptor
Name:Beta-3 adrenergic receptor
Type:G Protein-Coupled Receptor (GPCR)
Mol. Mass.:43534.88
Organism:Homo sapiens (Human)
Description:n/a
Residue:408
BDBM50106817
NameBDBM50106817
Synonyms:CHEMBL322863 | N-(4-{(4-Acetylamino-phenyl)-[(R)-2-hydroxy-2-(4-hydroxy-3-methanesulfonylamino-phenyl)-ethylamino]-methyl}-phenyl)-acetamide
TypeSmall organic molecule
Emp. Form.C26H30N4O6S
Mol. Mass.526.605
SMILESCC(=O)Nc1ccc(cc1)C(NC[C@H](O)c1ccc(O)c(NS(C)(=O)=O)c1)c1ccc(NC(C)=O)cc1