Reaction Details
TargetProthrombin
LigandBDBM50107437
Substrate/Competitorn/a
Meas. Tech.ChEBML_87153
IC50 27000±n/a nM
Citation Das, JKimball, SDReid, JAWang, TCLau, WFRoberts, DGSeiler, SMSchumacher, WAOgletree, ML Thrombin active site inhibitors: chemical synthesis, in vitro and in vivo pharmacological profile of a novel and selective agent BMS-189090 and analogues. Bioorg Med Chem Lett12:41-4 (2001) Prothrombin
Name:Prothrombin
Type:Protein
Mol. Mass.:70029.57
Organism:Homo sapiens (Human)
Description:P00734
Residue:622
BDBM50107437
NameBDBM50107437
Synonyms:(2R,4R)-4-Methyl-1-[2-(naphthalene-2-sulfonylamino)-acetyl]-piperidine-2-carboxylic acid (4-guanidino-butyl)-amide | CHEMBL137562
TypeSmall organic molecule
Emp. Form.C24H34N6O4S
Mol. Mass.502.63
SMILESC[C@@H]1CCN([C@H](C1)C(=O)NCCCCNC(N)=N)C(=O)CNS(=O)(=O)c1ccc2ccccc2c1