Reaction Details
TargetProthrombin
LigandBDBM50107439
Substrate/Competitorn/a
Meas. Tech.ChEBML_87153
IC50 310±n/a nM
Citation Das, JKimball, SDReid, JAWang, TCLau, WFRoberts, DGSeiler, SMSchumacher, WAOgletree, ML Thrombin active site inhibitors: chemical synthesis, in vitro and in vivo pharmacological profile of a novel and selective agent BMS-189090 and analogues. Bioorg Med Chem Lett12:41-4 (2001) Prothrombin
Name:Prothrombin
Type:Protein
Mol. Mass.:70029.57
Organism:Homo sapiens (Human)
Description:P00734
Residue:622
BDBM50107439
NameBDBM50107439
Synonyms:1-Carbamimidoyl-piperidine-3-carboxylic acid {(S)-1-[2-(naphthalene-2-sulfonylamino)-acetyl]-pyrrolidin-2-ylmethyl}-amide | CHEMBL342904
TypeSmall organic molecule
Emp. Form.C24H32N6O4S
Mol. Mass.500.614
SMILESNC(=N)N1CCC[C@@H](C1)C(=O)NC[C@@H]1CCCN1C(=O)CNS(=O)(=O)c1ccc2ccccc2c1