Reaction Details
TargetProthrombin
LigandBDBM50107449
Substrate/Competitorn/a
Meas. Tech.ChEBML_87153
IC50 110±n/a nM
Citation Das, JKimball, SDReid, JAWang, TCLau, WFRoberts, DGSeiler, SMSchumacher, WAOgletree, ML Thrombin active site inhibitors: chemical synthesis, in vitro and in vivo pharmacological profile of a novel and selective agent BMS-189090 and analogues. Bioorg Med Chem Lett12:41-4 (2001) Prothrombin
Name:Prothrombin
Type:Protein
Mol. Mass.:70029.57
Organism:Homo sapiens (Human)
Description:P00734
Residue:622
BDBM50107449
NameBDBM50107449
Synonyms:1-Carbamimidoyl-piperidine-4-carboxylic acid {(S)-1-[(S)-3-hydroxy-2-(naphthalene-2-sulfonylamino)-propionyl]-pyrrolidin-2-ylmethyl}-amide | CHEMBL136755
TypeSmall organic molecule
Emp. Form.C25H34N6O5S
Mol. Mass.530.64
SMILESNC(=N)N1CCC(CC1)C(=O)NC[C@@H]1CCCN1C(=O)[C@H](CO)NS(=O)(=O)c1ccc2ccccc2c1