Reaction Details
TargetProthrombin
LigandBDBM50107460
Substrate/Competitorn/a
Meas. Tech.ChEBML_207982
IC50 2±n/a nM
Citation Das, JKimball, SDHall, SEHan, WCIwanowicz, ELin, JMoquin, RVReid, JASack, JSMalley, MFChang, CYChong, SWang-Iverson, DBRoberts, DGSeiler, SMSchumacher, WAOgletree, ML Molecular design and structure--activity relationships leading to the potent, selective, and orally active thrombin active site inhibitor BMS-189664. Bioorg Med Chem Lett12:45-9 (2001) Prothrombin
Name:Prothrombin
Type:Protein
Mol. Mass.:70029.57
Organism:Homo sapiens (Human)
Description:P00734
Residue:622
BDBM50107460
NameBDBM50107460
Synonyms:(S)-1-((R)-3-Phenyl-2-phenylmethanesulfonylamino-propionyl)-pyrrolidine-2-carboxylic acid [1-(N-hydroxycarbamimidoyl)-piperidin-4-ylmethyl]-amide | CHEMBL424316
TypeSmall organic molecule
Emp. Form.C28H38N6O5S
Mol. Mass.570.704
SMILESONC(=N)N1CCC(CNC(=O)[C@@H]2CCCN2C(=O)[C@@H](Cc2ccccc2)NS(=O)(=O)Cc2ccccc2)CC1