Reaction Details
TargetProthrombin
LigandBDBM50107469
Substrate/Competitorn/a
Meas. Tech.ChEBML_207982
IC50 4900±n/a nM
Citation Das, JKimball, SDHall, SEHan, WCIwanowicz, ELin, JMoquin, RVReid, JASack, JSMalley, MFChang, CYChong, SWang-Iverson, DBRoberts, DGSeiler, SMSchumacher, WAOgletree, ML Molecular design and structure--activity relationships leading to the potent, selective, and orally active thrombin active site inhibitor BMS-189664. Bioorg Med Chem Lett12:45-9 (2001) Prothrombin
Name:Prothrombin
Type:Protein
Mol. Mass.:70029.57
Organism:Homo sapiens (Human)
Description:P00734
Residue:622
BDBM50107469
NameBDBM50107469
Synonyms:(S)-1-[(S)-6-Amino-2-(naphthalene-2-sulfonylamino)-hexanoyl]-pyrrolidine-2-carboxylic acid (4-guanidino-butyl)-amide | CHEMBL356745
TypeSmall organic molecule
Emp. Form.C26H39N7O4S
Mol. Mass.545.697
SMILESNCCCC[C@H](NS(=O)(=O)c1ccc2ccccc2c1)C(=O)N1CCC[C@H]1C(=O)NCCCCNC(N)=N