Reaction Details
TargetProthrombin
LigandBDBM50107475
Substrate/Competitorn/a
Meas. Tech.ChEBML_207982
IC50 670±n/a nM
Citation Das, JKimball, SDHall, SEHan, WCIwanowicz, ELin, JMoquin, RVReid, JASack, JSMalley, MFChang, CYChong, SWang-Iverson, DBRoberts, DGSeiler, SMSchumacher, WAOgletree, ML Molecular design and structure--activity relationships leading to the potent, selective, and orally active thrombin active site inhibitor BMS-189664. Bioorg Med Chem Lett12:45-9 (2001) Prothrombin
Name:Prothrombin
Type:Protein
Mol. Mass.:70029.57
Organism:Homo sapiens (Human)
Description:P00734
Residue:622
BDBM50107475
NameBDBM50107475
Synonyms:CHEMBL148391 | {(R)-1-Benzyl-2-[(S)-2-(4-guanidino-butylcarbamoyl)-pyrrolidin-1-yl]-2-oxo-ethyl}-carbamic acid benzyl ester
TypeSmall organic molecule
Emp. Form.C27H36N6O4
Mol. Mass.508.6125
SMILESNC(=N)NCCCCNC(=O)[C@@H]1CCCN1C(=O)[C@@H](Cc1ccccc1)NC(=O)OCc1ccccc1