Reaction Details
TargetTyrosine-protein kinase Lck
LigandBDBM50112980
Substrate/Competitorn/a
Meas. Tech.ChEBML_221513
IC50 100±n/a nM
Citation Hobbs, CJBit, RACansfield, ADHarris, BHill, CHHilyard, KLKilford, IRKitas, EKroehn, ALovell, PPole, DRugman, PSherborne, BSSmith, IEVesey, DRWalmsley, DLWhittaker, DWilliams, GWilson, FBanner, DSurgenor, ABorkakoti, N Structure-based design of peptidomimetic antagonists of p56(lck) SH2 domain. Bioorg Med Chem Lett12:1365-9 (2002) Tyrosine-protein kinase Lck
Name:Tyrosine-protein kinase Lck
Type:n/a
Mol. Mass.:57987.83
Organism:Homo sapiens (Human)
Description:P06239
Residue:509
BDBM50112980
NameBDBM50112980
Synonyms:(1R,3R)-3-({(1S,9S)-9-[(S)-2-Acetylamino-3-(4-phosphonooxy-phenyl)-propionylamino]-6,10-dioxo-octahydro-pyridazino[1,2-a][1,2]diazepine-1-carbonyl}-amino)-indan-1-carboxylic acid | CHEMBL418026
TypeSmall organic molecule
Emp. Form.C31H36N5O11P
Mol. Mass.685.6182
SMILESCC(=O)N[C@@H](Cc1ccc(OP(O)(O)=O)cc1)C(=O)N[C@H]1CCC(=O)N2CCC[C@H](N2C1=O)C(=O)N[C@@H]1C[C@@H](C(O)=O)c2ccccc12