Reaction Details
TargetAcetylcholinesterase
LigandBDBM50117577
Substrate/Competitorn/a
Meas. Tech.ChEMBL_70883 (CHEMBL684541)
EC50 19±n/a nM
Citation Clark, JKCowley, PMuir, AWPalin, RPow, EProsser, ABTaylor, RZhang, MQ Quaternary salts of E2020 analogues as acetylcholinesterase inhibitors for the reversal of neuromuscular block. Bioorg Med Chem Lett12:2565-8 (2002) Acetylcholinesterase
Name:Acetylcholinesterase
Type:Enzyme
Mol. Mass.:67792.70
Organism:Homo sapiens (Human)
Description:P22303
Residue:614
BDBM50117577
NameBDBM50117577
Synonyms:1-Benzyl-4-[3-(5,6-dimethoxy-benzo[b]thiophen-2-yl)-3-oxo-propyl]-1-methyl-piperidinium | CHEMBL87273
TypeSmall organic molecule
Emp. Form.C26H32NO3S
Mol. Mass.438.602
SMILESCOc1cc2cc(sc2cc1OC)C(=O)CCC1CC[N+](C)(Cc2ccccc2)CC1