Reaction Details
TargetAcetylcholinesterase
LigandBDBM50037157
Substrate/Competitorn/a
Meas. Tech.ChEBML_70883
EC50 1140±n/a nM
Citation Clark, JKCowley, PMuir, AWPalin, RPow, EProsser, ABTaylor, RZhang, MQ Quaternary salts of E2020 analogues as acetylcholinesterase inhibitors for the reversal of neuromuscular block. Bioorg Med Chem Lett12:2565-8 (2002) Acetylcholinesterase
Name:Acetylcholinesterase
Type:Enzyme
Mol. Mass.:67792.70
Organism:Homo sapiens (Human)
Description:P22303
Residue:614
BDBM50037157
NameBDBM50037157
Synonyms:3-(1-Benzyl-piperidin-4-yl)-1-(2,3,4,5-tetrahydro-1H-benzo[b]azepin-8-yl)-propan-1-one CHEMBL75013 Zanapezil
TypeSmall organic molecule
Emp. Form.C25H32N2O
Mol. Mass.376.5344
SMILESO=C(CCC1CCN(Cc2ccccc2)CC1)c1ccc2CCCCNc2c1