Reaction Details
TargetAcetylcholinesterase
LigandBDBM50117592
Substrate/Competitorn/a
Meas. Tech.ChEBML_70883
EC50 100±n/a nM
Citation Clark, JKCowley, PMuir, AWPalin, RPow, EProsser, ABTaylor, RZhang, MQ Quaternary salts of E2020 analogues as acetylcholinesterase inhibitors for the reversal of neuromuscular block. Bioorg Med Chem Lett12:2565-8 (2002) Acetylcholinesterase
Name:Acetylcholinesterase
Type:Enzyme
Mol. Mass.:67792.70
Organism:Homo sapiens (Human)
Description:P22303
Residue:614
BDBM50117592
NameBDBM50117592
Synonyms:1-Benzyl-4-(5,6-dimethoxy-1-oxo-indan-2-ylmethyl)-pyridinium | CHEMBL87632
TypeSmall organic molecule
Emp. Form.C24H24NO3
Mol. Mass.374.4517
SMILESCOc1cc2CC(Cc3cc[n+](Cc4ccccc4)cc3)C(=O)c2cc1OC