Reaction Details
TargetAcetylcholinesterase
LigandBDBM50117615
Substrate/Competitorn/a
Meas. Tech.ChEBML_28291
EC50 650±n/a nM
Citation Palin, RClark, JKCowley, PMuir, AWPow, EProsser, ABTaylor, RZhang, MQ Novel piperidinium and pyridinium agents as water-soluble acetylcholinesterase inhibitors for the reversal of neuromuscular blockade. Bioorg Med Chem Lett12:2569-72 (2002) Acetylcholinesterase
Name:Acetylcholinesterase
Type:Enzyme
Mol. Mass.:67792.70
Organism:Homo sapiens (Human)
Description:P22303
Residue:614
BDBM50117615
NameBDBM50117615
Synonyms:1-Benzyl-4-[3-(5,6-dimethoxy-benzo[b]thiophen-2-yl)-1-methoxy-3-oxo-propyl]-1-methyl-piperidinium; bromide | CHEMBL314398
TypeSmall organic molecule
Emp. Form.C27H34NO4S
Mol. Mass.468.628
SMILESCOC(CC(=O)c1cc2cc(OC)c(OC)cc2s1)C1CC[N+](C)(Cc2ccccc2)CC1