Reaction Details
TargetAcetylcholinesterase
LigandBDBM50117623
Substrate/Competitorn/a
Meas. Tech.ChEMBL_70887 (CHEMBL684545)
EC50 1720±n/a nM
Citation Palin, RClark, JKCowley, PMuir, AWPow, EProsser, ABTaylor, RZhang, MQ Novel piperidinium and pyridinium agents as water-soluble acetylcholinesterase inhibitors for the reversal of neuromuscular blockade. Bioorg Med Chem Lett12:2569-72 (2002) Acetylcholinesterase
Name:Acetylcholinesterase
Type:Enzyme
Mol. Mass.:67792.70
Organism:Homo sapiens (Human)
Description:P22303
Residue:614
BDBM50117623
NameBDBM50117623
Synonyms:1-Cyclobutylmethyl-4-[3-(5,6-dimethoxy-benzo[b]thiophen-2-yl)-3-oxo-propyl]-pyridinium; bromide | CHEMBL82810
TypeSmall organic molecule
Emp. Form.C23H26NO3S
Mol. Mass.396.522
SMILESCOc1cc2cc(sc2cc1OC)C(=O)CCc1cc[n+](CC2CCC2)cc1