Reaction Details
TargetSodium-dependent serotonin transporter
LigandBDBM50110577
Substrate/Competitorn/a
Meas. Tech.ChEBML_201974
Ki 0.013000±n/a nM
Citation Se Lee, BChu, SLee, BSYoon Chi, DSong, YSJin, C Syntheses and binding affinities of 6-nitroquipazine analogues for serotonin transporter. Part 2: 4-substituted 6-nitroquipazines. Bioorg Med Chem Lett12:811-5 (2002) Sodium-dependent serotonin transporter
Name:Sodium-dependent serotonin transporter
Type:Multi-pass membrane protein
Mol. Mass.:70168.43
Organism:Rattus norvegicus (rat)
Description:P31652
Residue:630
BDBM50110577
NameBDBM50110577
Synonyms:2-(2-((dimethylamino)methyl)phenylthio)-5-iodoaniline CHEMBL23034 | CHEMBL2314218
TypeSmall organic molecule
Emp. Form.C15H17IN2S
Mol. Mass.384.278
SMILESCN(C)Cc1ccccc1Sc1ccc(I)cc1N