Reaction Details
TargetSodium-dependent serotonin transporter
LigandBDBM50110582
Substrate/Competitorn/a
Meas. Tech.ChEBML_201974
Ki 67±n/a nM
Citation Se Lee, BChu, SLee, BSYoon Chi, DSong, YSJin, C Syntheses and binding affinities of 6-nitroquipazine analogues for serotonin transporter. Part 2: 4-substituted 6-nitroquipazines. Bioorg Med Chem Lett12:811-5 (2002) Sodium-dependent serotonin transporter
Name:Sodium-dependent serotonin transporter
Type:Multi-pass membrane protein
Mol. Mass.:70168.43
Organism:Rattus norvegicus (rat)
Description:P31652
Residue:630
BDBM50110582
NameBDBM50110582
Synonyms:6-Nitro-2-piperazin-1-yl-4-thiophen-2-yl-quinoline | CHEMBL436441
TypeSmall organic molecule
Emp. Form.C17H16N4O2S
Mol. Mass.340.4
SMILES[O-][N+](=O)c1ccc2nc(cc(-c3cccs3)c2c1)N1CCNCC1