Reaction Details
TargetcGMP-specific 3',5'-cyclic phosphodiesterase
LigandBDBM50130017
Substrate/Competitorn/a
Meas. Tech.ChEBML_155194
IC50 0.230000±n/a nM
Citation Ukita, TNakamura, YKubo, AYamamoto, YMoritani, YSaruta, KHigashijima, TKotera, JFujishige, KTakagi, MKikkawa, KOmori, K 1,7- and 2,7-naphthyridine derivatives as potent and highly specific PDE5 inhibitors. Bioorg Med Chem Lett13:2341-5 (2003) cGMP-specific 3',5'-cyclic phosphodiesterase
Name:cGMP-specific 3',5'-cyclic phosphodiesterase
Type:PROTEIN
Mol. Mass.:98285.03
Organism:Canis lupus familiaris
Description:ChEMBL_105565
Residue:865
BDBM50130017
NameBDBM50130017
Synonyms:2-(2-Methyl-pyridin-4-ylmethyl)-1-oxo-8-(pyrimidin-2-ylmethoxy)-4-(3,4,5-trimethoxy-phenyl)-1,2-dihydro-[2,7]naphthyridine-3-carboxylic acid methyl ester; hydrochloride | CHEMBL540294
TypeSmall organic molecule
Emp. Form.C31H29N5O7
Mol. Mass.583.5913
SMILESCOC(=O)c1c(-c2cc(OC)c(OC)c(OC)c2)c2ccnc(OCc3ncccn3)c2c(=O)n1Cc1ccnc(C)c1