Reaction Details
TargetP04972/P11541/P16586/P22571/P23439/Q95142
LigandBDBM50100662
Substrate/Competitorn/a
Meas. Tech.ChEMBL_155383 (CHEMBL760836)
IC50 28±n/a nM
Citation Ukita, TNakamura, YKubo, AYamamoto, YMoritani, YSaruta, KHigashijima, TKotera, JFujishige, KTakagi, MKikkawa, KOmori, K 1,7- and 2,7-naphthyridine derivatives as potent and highly specific PDE5 inhibitors. Bioorg Med Chem Lett13:2341-5 (2003) P04972/P11541/P16586/P22571/P23439/Q95142
Name:P04972/P11541/P16586/P22571/P23439/Q95142
Synonyms:Phosphodiesterase 6
Type:n/a
Mol. Mass.:n/a
Description:ASSAY_ID of ChEMBL is 155381
Components:This complex has 6 components.
Component 1
Name:Retinal rod rhodopsin-sensitive cGMP 3',5'-cyclic phosphodiesterase subunit gamma
Type:PROTEIN
Mol. Mass.:9674.16
Organism:Bos taurus
Description:ChEMBL_104859
Residue:87
Component 2
Name:Cone cGMP-specific 3',5'-cyclic phosphodiesterase subunit alpha'
Synonyms:PDE V-C1 PDE6C_BOVIN cGMP phosphodiesterase 6C
Type:PROTEIN
Mol. Mass.:98783.85
Organism:Bos taurus
Description:ChEMBL_104859
Residue:855
Component 3
Name:Rod cGMP-specific 3',5'-cyclic phosphodiesterase subunit alpha
Synonyms:PDE6A PDEA Phosphodiesterase 6A
Type:Enzyme
Mol. Mass.:99320.22
Organism:Bos taurus (Bovine)
Description:P11541
Residue:859
Component 4
Name:Retinal cone rhodopsin-sensitive cGMP 3',5'-cyclic phosphodiesterase subunit gamma
Synonyms:CNCG_BOVIN PDE6H
Type:PROTEIN
Mol. Mass.:9106.39
Organism:Bos taurus
Description:ChEMBL_104859
Residue:83
Component 5
Name:Retinal rod rhodopsin-sensitive cGMP 3',5'-cyclic phosphodiesterase subunit delta
Synonyms:GMP-PDE delta PDE6D_BOVIN
Type:PROTEIN
Mol. Mass.:17388.28
Organism:Bos taurus
Description:ChEMBL_104859
Residue:150
Component 6
Name:Rod cGMP-specific 3',5'-cyclic phosphodiesterase subunit beta
Synonyms:GMP-PDE beta PDE6B_BOVIN | PDEB
Type:PROTEIN
Mol. Mass.:98307.54
Organism:Bos taurus
Description:ChEMBL_104859
Residue:853
BDBM50100662
NameBDBM50100662
Synonyms:CHEMBL553371 methyl 2-(4-aminophenyl)-1-oxo-7-(2-pyridylmethoxy)-4-(3,4,5-trimethoxyphenyl)-1,2-dihydro-3-isoquinolinecarboxylate.dihydrochloride
TypeSmall organic molecule
Emp. Form.C32H29N3O7
Mol. Mass.567.5886
SMILESCOC(=O)c1c(-c2cc(OC)c(OC)c(OC)c2)c2ccc(OCc3ccccn3)cc2c(=O)n1-c1ccc(N)cc1