Reaction Details
TargetMu-type opioid receptor
LigandBDBM82551
Substrate/Competitorn/a
Meas. Tech.ChEMBL_145142 (CHEMBL755287)
Ki 15±n/a nM
Citation Ananthan, SKezar, HSSaini, SKKhare, NKDavis, PDersch, CMPorreca, FRothman, RB Synthesis, opioid receptor binding, and functional activity of 5'-substituted 17-cyclopropylmethylpyrido[2',3':6,7]morphinans. Bioorg Med Chem Lett13:529-32 (2003) Mu-type opioid receptor
Name:Mu-type opioid receptor
Type:Enzyme Catalytic Domain
Mol. Mass.:11165.58
Organism:GUINEA PIG
Description:P97266
Residue:98
BDBM82551
NameBDBM82551
Synonyms:C18130 NOR-BNI (HCI)2 | NORBNI
TypeSmall organic molecule
Emp. Form.C40H43N3O6
Mol. Mass.661.7859
SMILESOc1ccc2C[C@H]3N(CC4CC4)CC[C@@]45[C@@H](Oc1c24)c1[nH]c2[C@@H]4Oc6c7c(C[C@H]8N(CC9CC9)CC[C@@]47[C@@]8(O)Cc2c1C[C@@]35O)ccc6O