Reaction Details
TargetBeta-secretase 1
LigandBDBM50137678
Substrate/Competitorn/a
Meas. Tech.ChEMBL_41388 (CHEMBL653510)
IC50 28±n/a nM
Citation Lamar, JHu, JBueno, ABYang, HCGuo, DCopp, JDMcGee, JGitter, BTimm, DMay, PMcCarthy, JChen, SH Phe*-Ala-based pentapeptide mimetics are BACE inhibitors: P2 and P3 SAR. Bioorg Med Chem Lett14:239-43 (2003) Beta-secretase 1
Name:Beta-secretase 1
Type:Protein
Mol. Mass.:55755.10
Organism:Homo sapiens (Human)
Description:P56817
Residue:501
BDBM50137678
NameBDBM50137678
Synonyms:CHEMBL312277 | [(S)-1-((S)-1-{(3S,4S)-1-Benzyl-4-[(R)-1-((S)-benzylcarbamoyl)-2-methyl-propylcarbamoyl]-2-hydroxy-pentylcarbamoyl}-3-methylsulfanyl-propylcarbamoyl)-2-methyl-propyl]-carbamic acid tert-butyl ester
TypeSmall organic molecule
Emp. Form.C40H61N5O7S
Mol. Mass.756.007
SMILESCSCC[C@H](NC(=O)[C@@H](NC(=O)OC(C)(C)C)C(C)C)C(=O)N[C@@H](Cc1ccccc1)[C@@H](O)C[C@@H](C)C(=O)N[C@@H](C(C)C)C(=O)NCc1ccccc1