Reaction Details
TargetKappa-type opioid receptor
LigandBDBM83436
Substrate/Competitorn/a
Meas. Tech.ChEBML_147220
Ki 17±n/a nM
Citation Clark, CRHalfpenny, PRHill, RGHorwell, DCHughes, JJarvis, TCRees, DCSchofield, D Highly selective kappa opioid analgesics. Synthesis and structure-activity relationships of novel N-[(2-aminocyclohexyl)aryl]acetamide and N-[(2-aminocyclohexyl)aryloxy]acetamide derivatives. J Med Chem31:831-6 (1988) Kappa-type opioid receptor
Name:Kappa-type opioid receptor
Type:G Protein-Coupled Receptor (GPCR)
Mol. Mass.:42744.99
Organism:Cavia porcellus (domestic guinea pig)
Description:P41144
Residue:380
BDBM83436
NameBDBM83436
Synonyms:2-(3,4-dichlorophenyl)-N-methyl-N-[(5R,7S,8S)-7-(1-pyrrolidinyl)-1-oxaspiro[4.5]decan-8-yl]acetamide;methanesulfonic acid 2-(3,4-dichlorophenyl)-N-methyl-N-[(5R,7S,8S)-7-pyrrolidin-1-yl-1-oxaspiro[4.5]decan-8-yl]ethanamide;methanesulfonic acid MLS002153429 Spiradoline cid_55651
TypeSmall organic molecule
Emp. Form.C22H30Cl2N2O2
Mol. Mass.425.392
SMILESCN([C@H]1CC[C@@]2(CCCO2)C[C@@H]1N1CCCC1)C(=O)Cc1ccc(Cl)c(Cl)c1