Reaction Details
TargetAdenosylhomocysteinase
LigandBDBM50023879
Substrate/Competitorn/a
Meas. Tech.ChEBML_197203
Ki 110±n/a nM
Citation Borcherding, DRNarayanan, SHasobe, MMcKee, JGKeller, BTBorchardt, RT Potential inhibitors of S-adenosylmethionine-dependent methyltransferases. 11. Molecular dissections of neplanocin A as potential inhibitors of S-adenosylhomocysteine hydrolase. J Med Chem31:1729-38 (1988) Adenosylhomocysteinase
Name:Adenosylhomocysteinase
Type:PROTEIN
Mol. Mass.:47714.06
Organism:Homo sapiens (Human)
Description:ChEMBL_1507791
Residue:432
BDBM50023879
NameBDBM50023879
Synonyms:2-[2-(6-Amino-purin-9-yl)-ethylidene]-propane-1,3-diol | CHEMBL49908
TypeSmall organic molecule
Emp. Form.C10H13N5O2
Mol. Mass.235.2425
SMILES[#7]-c1ncnc2n(-[#6]\[#6]=[#6](/[#6]-[#8])-[#6]-[#8])cnc12