Reaction Details
TargetAdenosylhomocysteinase
LigandBDBM50011148
Substrate/Competitorn/a
Meas. Tech.ChEBML_197203
Ki 125±n/a nM
Citation Borcherding, DRNarayanan, SHasobe, MMcKee, JGKeller, BTBorchardt, RT Potential inhibitors of S-adenosylmethionine-dependent methyltransferases. 11. Molecular dissections of neplanocin A as potential inhibitors of S-adenosylhomocysteine hydrolase. J Med Chem31:1729-38 (1988) Adenosylhomocysteinase
Name:Adenosylhomocysteinase
Type:PROTEIN
Mol. Mass.:47714.06
Organism:Homo sapiens (Human)
Description:ChEMBL_1507791
Residue:432
BDBM50011148
NameBDBM50011148
Synonyms:(Z)-4-(6-Amino-purin-9-yl)-but-2-en-1-ol CHEMBL45537
TypeSmall organic molecule
Emp. Form.C9H11N5O
Mol. Mass.205.2165
SMILESNc1ncnc2n(C\C=C/CO)cnc12