Reaction Details
TargetAdenosylhomocysteinase
LigandBDBM50023886
Substrate/Competitorn/a
Meas. Tech.ChEBML_197203
Ki 166±n/a nM
Citation Borcherding, DRNarayanan, SHasobe, MMcKee, JGKeller, BTBorchardt, RT Potential inhibitors of S-adenosylmethionine-dependent methyltransferases. 11. Molecular dissections of neplanocin A as potential inhibitors of S-adenosylhomocysteine hydrolase. J Med Chem31:1729-38 (1988) Adenosylhomocysteinase
Name:Adenosylhomocysteinase
Type:PROTEIN
Mol. Mass.:47714.06
Organism:Homo sapiens (Human)
Description:ChEMBL_1507791
Residue:432
BDBM50023886
NameBDBM50023886
Synonyms:2-[2-(4-Amino-imidazo[4,5-c]pyridin-1-yl)-ethylidene]-propane-1,3-diol | CHEMBL50600
TypeSmall organic molecule
Emp. Form.C11H14N4O2
Mol. Mass.234.2545
SMILES[#7]-c1nccc2n(-[#6]\[#6]=[#6](/[#6]-[#8])-[#6]-[#8])cnc12