Reaction Details
TargetAdenosylhomocysteinase
LigandBDBM50023883
Substrate/Competitorn/a
Meas. Tech.ChEMBL_197203 (CHEMBL798952)
IC50 1230±n/a nM
Citation Borcherding, DRNarayanan, SHasobe, MMcKee, JGKeller, BTBorchardt, RT Potential inhibitors of S-adenosylmethionine-dependent methyltransferases. 11. Molecular dissections of neplanocin A as potential inhibitors of S-adenosylhomocysteine hydrolase. J Med Chem31:1729-38 (1988) Adenosylhomocysteinase
Name:Adenosylhomocysteinase
Type:PROTEIN
Mol. Mass.:47714.06
Organism:Homo sapiens (Human)
Description:ChEMBL_1507791
Residue:432
BDBM50023883
NameBDBM50023883
Synonyms:4-(4-Amino-imidazo[4,5-c]pyridin-1-yl)-but-2-en-1-ol | CHEMBL50388
TypeSmall organic molecule
Emp. Form.C10H12N4O
Mol. Mass.204.2285
SMILESNc1nccc2n(C\C=C\CO)cnc12