Reaction Details
TargetKappa-type opioid receptor
LigandBDBM50016830
Substrate/Competitorn/a
Meas. Tech.ChEMBL_145375 (CHEMBL753143)
Ki 22±n/a nM
Citation Bryan, WMCallahan, JFCodd, EELemieux, CMoore, MLSchiller, PWWalker, RFHuffman, WF Cyclic enkephalin analogues containing alpha-amino-beta-mercapto-beta,beta-pentamethylenepropionic acid at positions 2 or 5. J Med Chem32:302-4 (1989) Kappa-type opioid receptor
Name:Kappa-type opioid receptor
Type:G Protein-Coupled Receptor (GPCR)
Mol. Mass.:42692.90
Organism:Rattus norvegicus (rat)
Description:P34975
Residue:380
BDBM50016830
NameBDBM50016830
Synonyms:13-[2-Amino-3-(4-hydroxy-phenyl)-propionylamino]-7-benzyl-3,3-dimethyl-6,9,12-trioxo-1,2-dithia-5,8,11-triaza-cyclotetradecane-4-carboxylic acid | CHEMBL2370368
TypeSmall organic molecule
Emp. Form.C28H35N5O7S2
Mol. Mass.617.737
SMILESCC1(C)SSC[C@@H](NC(=O)[C@@H](N)Cc2ccc(O)cc2)C(=O)NCC(=O)N[C@@H](Cc2ccccc2)C(=O)N[C@@H]1C(O)=O