Reaction Details
Target5-hydroxytryptamine receptor 3A
LigandBDBM50014159
Substrate/Competitorn/a
Meas. Tech.ChEBML_3465
Ki 1.9±n/a nM
Citation Rosen, TNagel, AARizzi, JPIves, JLDaffeh, JBGanong, AHGuarino, KHeym, JMcLean, SNowakowski, JT Thiazole as a carbonyl bioisostere. A novel class of highly potent and selective 5-HT3 receptor antagonists. J Med Chem33:2715-20 (1990) 5-hydroxytryptamine receptor 3A
Name:5-hydroxytryptamine receptor 3A
Type:Protein
Mol. Mass.:55283.27
Organism:Homo sapiens (Human)
Description:P46098
Residue:478
BDBM50014159
NameBDBM50014159
Synonyms:4-(2-Fluoro-phenyl)-2-(5-methyl-1H-imidazol-4-ylmethyl)-thiazole | CHEMBL329179
TypeSmall organic molecule
Emp. Form.C14H12FN3S
Mol. Mass.273.329
SMILESCc1nc[nH]c1Cc1nc(cs1)-c1ccccc1F